Target
Thymidylate synthase
Ligand
BDBM50014501
Substrate
Meas. Tech.
ChEMBL_628669 (CHEMBL1106435)
IC50
43±n/a nM
Citation
 Srivastava, VGupta, SPSiddiqi, MIMishra, BN 3D-QSAR studies on quinazoline antifolate thymidylate synthase inhibitors by CoMFA and CoMSIA models. Eur J Med Chem 45:1560-71 (2010)  
Target
Name:
Thymidylate synthase
Synonyms:
TS TYMS Thymidylate synthase (TS) | Thymidylate synthase/GAR transformylase/AICAR transformylase
Type:
Enzyme
Mol. Mass.:
35718.07
Organism:
Homo sapiens (Human)
Description:
Residue:
313
  
Inhibitor
Name:
BDBM50014501
Synonyms:
(S)-2-(2-fluoro-4-((2-fluoroethyl)((2-methyl-4-oxo-3,4-dihydroquinazolin-6-yl)methyl)amino)benzamido)pentanedioic acid CHEMBL104358
Type:
Small organic molecule
Emp. Form.:
C24H24F2N4O6
Mol. Mass.:
502.4674
SMILES:
Cc1nc2ccc(CN(CCF)c3ccc(C(=O)N[C@@H](CCC(O)=O)C(O)=O)c(F)c3)cc2c(=O)[nH]1
: