Target
Inosine-5'-monophosphate dehydrogenase 2
Ligand
BDBM50416536
Substrate
Meas. Tech.
ChEMBL_649329 (CHEMBL1219027)
Ki
1500±n/a nM
Citation
 Chen, LPetrelli, RGao, GWilson, DJMcLean, GTJayaram, HNSham, YYPankiewicz, KW Dual inhibitors of inosine monophosphate dehydrogenase and histone deacetylase based on a cinnamic hydroxamic acid core structure. Bioorg Med Chem 18:5950-64 (2010)  
Target
Name:
Inosine-5'-monophosphate dehydrogenase 2
Synonyms:
IMDH2_HUMAN IMPD 2 IMPDH-II Inosine 5'-monophosphate dehydrogenase II (IMPDH II) Inosine-5 -monophosphate dehydrogenase 2 | Inosine-5'-monophosphate dehydrogenase (IMPDH)
Type:
Enzyme
Mol. Mass.:
55806.87
Organism:
Homo sapiens (Human)
Description:
Recombinant IMPDH2 expressed in E. coli.
Residue:
514
  
Inhibitor
Name:
BDBM50416536
Synonyms:
CHEMBL1215242
Type:
Small organic molecule
Emp. Form.:
C22H20N4O6
Mol. Mass.:
436.4174
SMILES:
COc1cc(NC(=O)C(=O)NCc2cccc(\C=C\C(=O)NO)c2)ccc1-c1cnco1
: