Target
Vasopressin V1b receptor
Ligand
BDBM50416647
Substrate
Meas. Tech.
ChEMBL_651956 (CHEMBL1227629)
IC50
501.19±n/a nM
Citation
 Arban, RBianchi, FBuson, ACremonesi, SDi Fabio, RGentile, GMicheli, FPasquarello, APozzan, ATarsi, LTerreni, STonelli, F Pyrrolo[1,2-a]pyrazine and pyrazolo[1,5-a]pyrazine: novel, potent, and selective series of Vasopressin 1b receptor antagonists. Bioorg Med Chem Lett 20:5044-9 (2010)  
Target
Name:
Vasopressin V1b receptor
Synonyms:
AVPR V1b AVPR1B Antidiuretic hormone receptor 1b V1bR VPR3 Vasopressin V1b receptor (V1b) Vasopressin V3 receptor
Type:
Enzyme
Mol. Mass.:
46985.01
Organism:
Homo sapiens (Human)
Description:
P47901
Residue:
424
  
Inhibitor
Name:
BDBM50416647
Synonyms:
CHEMBL1222837
Type:
Small organic molecule
Emp. Form.:
C24H30ClN5O2
Mol. Mass.:
455.98
SMILES:
CC(C)NC(=O)Cn1c(cn2cc(cc2c1=O)N1CCC(C1)N(C)C)-c1cccc(Cl)c1
: