Target
Muscarinic acetylcholine receptor M3
Ligand
BDBM50416730
Substrate
Meas. Tech.
ChEMBL_652865 (CHEMBL1226068)
EC50
630.96±n/a nM
Citation
 Johnson, DJForbes, ITWatson, SPGarzya, VStevenson, GIWalker, GRMudhar, HSFlynn, STWyman, PASmith, PWMurkitt, GSLucas, AJMookherjee, CRWatson, JMGartlon, JEBradford, AMBrown, F The discovery of a series of N-substituted 3-(4-piperidinyl)-1,3-benzoxazolinones and oxindoles as highly brain penetrant, selective muscarinic M1 agonists. Bioorg Med Chem Lett 20:5434-8 (2010)  
Target
Name:
Muscarinic acetylcholine receptor M3
Synonyms:
ACM3_HUMAN Cholinergic, muscarinic M3 Muscarinic receptor M3 | RecName: Full=Muscarinic acetylcholine receptor M3
Type:
Enzyme
Mol. Mass.:
66151.03
Organism:
Homo sapiens (Human)
Description:
P20309
Residue:
590
  
Inhibitor
Name:
BDBM50416730
Synonyms:
CHEMBL1223940
Type:
Small organic molecule
Emp. Form.:
C23H34N2O4
Mol. Mass.:
402.5271
SMILES:
COCCO[C@H]1CC[C@@](C)(CC1)N1CCC(CC1)n1c2cc(C)ccc2oc1=O
: