Target
Alpha-2B adrenergic receptor
Ligand
BDBM50417011
Substrate
Meas. Tech.
ChEMBL_664776 (CHEMBL1259386)
Ki
1.91±n/a nM
Citation
 Vacher, BFunes, PChopin, PCussac, DHeusler, PTourette, AMarien, M Rigid analogues of thea2-adrenergic blocker atipamezole: small changes, big consequences. J Med Chem 53:6986-95 (2010)  
Target
Name:
Alpha-2B adrenergic receptor
Synonyms:
ADA2B_HUMAN ADRA2L1 Adrenergic alpha2B Adrenergic receptor alpha Alpha-2 adrenergic receptor subtype C2 Alpha-2B adrenoreceptor | Alpha-2BAR
Type:
Enzyme
Mol. Mass.:
49964.20
Organism:
Homo sapiens (Human)
Description:
P18089
Residue:
450
  
Inhibitor
Name:
BDBM50417011
Synonyms:
CHEMBL1255617
Type:
Small organic molecule
Emp. Form.:
C15H14N2
Mol. Mass.:
222.2851
SMILES:
C1CC11c2ccccc2[C@H]2C[C@@]12c1cnc[nH]1
: