Target
Alpha-1B adrenergic receptor
Ligand
BDBM50417009
Substrate
Meas. Tech.
ChEMBL_664774 (CHEMBL1259384)
Ki
3.5±n/a nM
Citation
 Vacher, BFunes, PChopin, PCussac, DHeusler, PTourette, AMarien, M Rigid analogues of thea2-adrenergic blocker atipamezole: small changes, big consequences. J Med Chem 53:6986-95 (2010)  
Target
Name:
Alpha-1B adrenergic receptor
Synonyms:
ADA1B_HUMAN Adrenergic alpha1B Adrenergic receptor alpha Alpha 1B-adrenoreceptor | Alpha-1B adrenergic receptor
Type:
Enzyme
Mol. Mass.:
56862.13
Organism:
Homo sapiens (Human)
Description:
P35368
Residue:
520
  
Inhibitor
Name:
BDBM50417009
Synonyms:
CHEMBL1255724
Type:
Small organic molecule
Emp. Form.:
C16H18N2
Mol. Mass.:
238.3275
SMILES:
CCC[C@H]1[C@@H]2c3ccccc3C[C@]12c1cnc[nH]1
: