Target
Acetylcholine-binding protein
Ligand
BDBM50417102
Substrate
Meas. Tech.
ChEMBL_665337 (CHEMBL1261014)
Kd
4467±n/a nM
Citation
 de Kloe, GERetra, KGeitmann, MKällblad, PNahar, Tvan Elk, RSmit, ABvan Muijlwijk-Koezen, JELeurs, RIrth, HDanielson, UHde Esch, IJ Surface plasmon resonance biosensor based fragment screening using acetylcholine binding protein identifies ligand efficiency hot spots (LE hot spots) by deconstruction of nicotinic acetylcholine receptora7 ligands. J Med Chem 53:7192-201 (2010)  
Target
Name:
Acetylcholine-binding protein
Synonyms:
ACHP_LYMST Acetylcholine Binding protein Acetylcholine-binding protein (Ls-AchBP) | AchBP
Type:
Mol. Mass.:
26055.52
Organism:
Lymnaea stagnalis
Description:
Soluble acetylcholine receptor
Residue:
229
  
Inhibitor
Name:
BDBM50417102
Synonyms:
CHEMBL1255908
Type:
Small organic molecule
Emp. Form.:
C14H17BrN2O2
Mol. Mass.:
325.201
SMILES:
Brc1ccc(NC(=O)O[C@H]2CN3CCC2CC3)cc1
: