Target
Alpha-2A adrenergic receptor
Ligand
BDBM50218115
Substrate
Meas. Tech.
ChEMBL_684813 (CHEMBL1285950)
Ki
60±n/a nM
Citation
 Del Bello, FMattioli, LGhelfi, FGiannella, MPiergentili, AQuaglia, WCardinaletti, CPerfumi, MThomas, RJZanelli, UMarchioro, CDal Cin, MPigini, M Fruitful adrenergica(2C)-agonism/a(2A)-antagonism combination to prevent and contrast morphine tolerance and dependence. J Med Chem 53:7825-35 (2010)  
Target
Name:
Alpha-2A adrenergic receptor
Synonyms:
ADA2A_HUMAN ADRA2R Adrenergic alpha2A Alpha-2 adrenergic receptor subtype C10 Alpha-2A adrenoreceptor alpha-2A adrenergic receptor [Homo sapiens]
Type:
Enzyme
Mol. Mass.:
48979.91
Organism:
Homo sapiens (Human)
Description:
P08913
Residue:
450
  
Inhibitor
Name:
BDBM50218115
Synonyms:
(R)-2-[1-(3'-nitrobiphenyl-2-yloxy)ethyl]-4,5-dihydro-1H-imidazole | CHEMBL242693
Type:
Small organic molecule
Emp. Form.:
C17H17N3O3
Mol. Mass.:
311.3352
SMILES:
C[C@@H](Oc1ccccc1-c1cccc(c1)[N+]([O-])=O)C1=NCCN1
: