Target
Alpha-2C adrenergic receptor
Ligand
BDBM50417350
Substrate
Meas. Tech.
ChEMBL_684821 (CHEMBL1286051)
Ki
18±n/a nM
Citation
 Del Bello, FMattioli, LGhelfi, FGiannella, MPiergentili, AQuaglia, WCardinaletti, CPerfumi, MThomas, RJZanelli, UMarchioro, CDal Cin, MPigini, M Fruitful adrenergica(2C)-agonism/a(2A)-antagonism combination to prevent and contrast morphine tolerance and dependence. J Med Chem 53:7825-35 (2010)  
Target
Name:
Alpha-2C adrenergic receptor
Synonyms:
ADA2C_HUMAN ADRA2L2 Adrenergic alpha2C Adrenergic receptor alpha Alpha-2 adrenergic receptor subtype C4 Alpha-2C adrenoreceptor | adrenergic, alpha-2C-, receptor [Homo sapiens]
Type:
Enzyme
Mol. Mass.:
49552.32
Organism:
Homo sapiens (Human)
Description:
P18825
Residue:
462
  
Inhibitor
Name:
BDBM50417350
Synonyms:
CHEMBL374584
Type:
Small organic molecule
Emp. Form.:
C17H18N2O2
Mol. Mass.:
282.337
SMILES:
CC(Oc1ccccc1-c1cccc(O)c1)C1=NCCN1
: