Target
Bcl-2-like protein 1
Ligand
BDBM21414
Substrate
Meas. Tech.
ChEMBL_687845 (CHEMBL1291409)
EC50
230.14±n/a nM
Citation
 Almerico, AMTutone, MLauria, A 3D-QSAR pharmacophore modeling and in silico screening of new Bcl-xl inhibitors. Eur J Med Chem 45:4774-82 (2010)  
Target
Name:
Bcl-2-like protein 1
Synonyms:
Anti-apoptotic Bcl-2 protein Apoptosis regulator Bcl-X BCL2-like 1 isoform 1 BCL2L1 Bcl-2-like protein 1 (Bcl-XL) Bcl-xL/Bcl-2-binding component 3 Bcl2-antagonist of cell death (BAD)
Type:
Mitochondrion membrane; Single-pass membrane protein
Mol. Mass.:
26039.60
Organism:
Homo sapiens (Human)
Description:
Residue:
233
  
Inhibitor
Name:
BDBM21414
Synonyms:
4-Alkyl-4-methoxypiperidine derivative, 8f | 4-{4-[(2-chlorophenyl)methyl]-4-methoxypiperidin-1-yl}-N-[(4-{[(2R)-4-(dimethylamino)-1-(phenylsulfanyl)butan-2-yl]amino}-3-nitrobenzene)sulfonyl]benzamide
Type:
Small organic molecule
Emp. Form.:
C38H44ClN5O6S2
Mol. Mass.:
766.369
SMILES:
COC1(Cc2ccccc2Cl)CCN(CC1)c1ccc(cc1)C(=O)NS(=O)(=O)c1ccc(N[C@H](CCN(C)C)CSc2ccccc2)c(c1)[N+]([O-])=O
: