Target
Bcl-2-like protein 1
Ligand
BDBM21437
Substrate
Meas. Tech.
ChEMBL_687845 (CHEMBL1291409)
EC50
5495.41±n/a nM
Citation
 Almerico, AMTutone, MLauria, A 3D-QSAR pharmacophore modeling and in silico screening of new Bcl-xl inhibitors. Eur J Med Chem 45:4774-82 (2010)  
Target
Name:
Bcl-2-like protein 1
Synonyms:
Anti-apoptotic Bcl-2 protein Apoptosis regulator Bcl-X BCL2-like 1 isoform 1 BCL2L1 Bcl-2-like protein 1 (Bcl-XL) Bcl-xL/Bcl-2-binding component 3 Bcl2-antagonist of cell death (BAD)
Type:
Mitochondrion membrane; Single-pass membrane protein
Mol. Mass.:
26039.60
Organism:
Homo sapiens (Human)
Description:
Residue:
233
  
Inhibitor
Name:
BDBM21437
Synonyms:
N-Benylpiperazine derivative, 23e | N-[(4-{[(2R)-4-(dimethylamino)-1-(phenylsulfanyl)butan-2-yl]amino}-3-nitrobenzene)sulfonyl]-4-{4-[(2-methanesulfonylphenyl)methyl]piperazin-1-yl}benzamide
Type:
Small organic molecule
Emp. Form.:
C37H44N6O7S3
Mol. Mass.:
780.976
SMILES:
CN(C)CC[C@H](CSc1ccccc1)Nc1ccc(cc1[N+]([O-])=O)S(=O)(=O)NC(=O)c1ccc(cc1)N1CCN(Cc2ccccc2S(C)(=O)=O)CC1
: