Target
Alpha-1B adrenergic receptor
Ligand
BDBM50417539
Substrate
Meas. Tech.
ChEMBL_693738 (CHEMBL1638257)
Ki
67.61±n/a nM
Citation
 Sagratini, GAngeli, PBuccioni, MGulini, UMarucci, GMelchiorre, CPoggesi, EGiardinà, D Synthesis anda1-adrenoceptor antagonist activity of tamsulosin analogues. Eur J Med Chem 45:5800-7 (2010)  
Target
Name:
Alpha-1B adrenergic receptor
Synonyms:
ADA1B_HUMAN Adrenergic alpha1B Adrenergic receptor alpha Alpha 1B-adrenoreceptor | Alpha-1B adrenergic receptor
Type:
Enzyme
Mol. Mass.:
56862.13
Organism:
Homo sapiens (Human)
Description:
P35368
Residue:
520
  
Inhibitor
Name:
BDBM50417539
Synonyms:
CHEMBL1630941
Type:
Small organic molecule
Emp. Form.:
C20H26N2O5S
Mol. Mass.:
406.496
SMILES:
COc1ccc(C[C@@H](C)NC[C@H]2Oc3ccccc3O[C@H]2C)cc1S(N)(=O)=O
: