Target
Alpha-1A adrenergic receptor
Ligand
BDBM50417540
Substrate
Meas. Tech.
ChEMBL_693737 (CHEMBL1638256)
Ki
0.603±n/a nM
Citation
 Sagratini, GAngeli, PBuccioni, MGulini, UMarucci, GMelchiorre, CPoggesi, EGiardinà, D Synthesis anda1-adrenoceptor antagonist activity of tamsulosin analogues. Eur J Med Chem 45:5800-7 (2010)  
Target
Name:
Alpha-1A adrenergic receptor
Synonyms:
ADA1A_HUMAN ADRA1C Alpha 1A-adrenoceptor Alpha adrenergic receptor 1a Alpha-adrenergic receptor 1c adrenergic Alpha1 | adrenergic Alpha1C
Type:
Cell-surface receptors
Mol. Mass.:
51511.67
Organism:
Homo sapiens (Human)
Description:
P35348
Residue:
466
  
Inhibitor
Name:
BDBM50417540
Synonyms:
CHEMBL1630940
Type:
Small organic molecule
Emp. Form.:
C20H25F3N2O5S
Mol. Mass.:
462.483
SMILES:
COc1ccc(C[C@@H](C)NCCOc2ccccc2OCC(F)(F)F)cc1S(N)(=O)=O
: