Target
Cytochrome P450 3A4
Ligand
BDBM50259874
Substrate
Meas. Tech.
ChEMBL_738355 (CHEMBL1743432)
Ki
54±n/a nM
Citation
 Fontana, EDansette, PMPoli, SM Cytochrome p450 enzymes mechanism based inhibitors: common sub-structures and reactivity. Curr Drug Metab 6:413-54 (2005)  
Target
Name:
Cytochrome P450 3A4
Synonyms:
Albendazole monooxygenase CP3A4_HUMAN CYP3A4 CYPIIIA4 Cytochrome P450 3A4 (CYP3A4) Nifedipine oxidase Taurochenodeoxycholate 6-alpha-hydroxylase
Type:
Enzyme
Mol. Mass.:
57349.57
Organism:
Homo sapiens (Human)
Description:
Residue:
503
  
Inhibitor
Name:
BDBM50259874
Synonyms:
(-)-dihydroclusin | CHEMBL469916
Type:
Small organic molecule
Emp. Form.:
C22H28O7
Mol. Mass.:
404.4535
SMILES:
COc1cc(C[C@@H](CO)[C@H](CO)Cc2ccc3OCOc3c2)cc(OC)c1OC
: