Target
Cytochrome P450 1A1
Ligand
BDBM50418082
Substrate
Meas. Tech.
ChEMBL_738443 (CHEMBL1743520)
Ki
220±n/a nM
Citation
 Fontana, EDansette, PMPoli, SM Cytochrome p450 enzymes mechanism based inhibitors: common sub-structures and reactivity. Curr Drug Metab 6:413-54 (2005)  
Target
Name:
Cytochrome P450 1A1
Synonyms:
CP1A1_HUMAN CYPIA1 Cytochrome P450 1A1 P450 form 6 P450-P1
Type:
Protein
Mol. Mass.:
58177.23
Organism:
Homo sapiens (Human)
Description:
P04798
Residue:
512
  
Inhibitor
Name:
BDBM50418082
Synonyms:
CHEMBL1743360
Type:
Small organic molecule
Emp. Form.:
C15H12
Mol. Mass.:
192.2558
SMILES:
CC#Cc1ccc(cc1)-c1ccccc1
: