Target
Cytochrome P450 3A6
Ligand
BDBM50014323
Substrate
Meas. Tech.
ChEMBL_738411 (CHEMBL1743488)
Ki
80100±n/a nM
Citation
 Fontana, EDansette, PMPoli, SM Cytochrome p450 enzymes mechanism based inhibitors: common sub-structures and reactivity. Curr Drug Metab 6:413-54 (2005)  
Target
Name:
Cytochrome P450 3A6
Synonyms:
CP3A6_RABIT CYPIIIA6 | Cytochrome P450-3C
Type:
PROTEIN
Mol. Mass.:
57463.93
Organism:
Oryctolagus cuniculus
Description:
ChEMBL_738411
Residue:
501
  
Inhibitor
Name:
BDBM50014323
Synonyms:
2-PHENYL-4H-BENZO[H]CHROMEN-4-ONE 7,8-Benzoflavone alpha-naphthoflavone
Type:
Small organic molecule
Emp. Form.:
C19H12O2
Mol. Mass.:
272.2974
SMILES:
O=c1cc(oc2c3ccccc3ccc12)-c1ccccc1
: