Target
Cytochrome P450 2C9
Ligand
BDBM50418550
Substrate
Meas. Tech.
ChEMBL_752251 (CHEMBL1785940)
EC50
39810.72±n/a nM
Citation
 Wendt, BMulbaier, MWawro, SSchultes, CAlonso, JJanssen, BLewis, J Toluidinesulfonamide hypoxia-induced factor 1 inhibitors: alleviating drug-drug interactions through use of PubChem data and comparative molecular field analysis guided synthesis. J Med Chem 54:3982-6 (2011)  
Target
Name:
Cytochrome P450 2C9
Synonyms:
(R)-limonene 6-monooxygenase CP2C9_HUMAN CYP2C9 Cytochrome P450 2C9 (CYP2C9 ) P-450MP P450 PB-1 | S-mephenytoin 4-hydroxylase
Type:
Enzyme
Mol. Mass.:
55636.33
Organism:
Homo sapiens (Human)
Description:
P11712
Residue:
490
  
Inhibitor
Name:
BDBM50418550
Synonyms:
CHEMBL1784698
Type:
Small organic molecule
Emp. Form.:
C16H17NO6S
Mol. Mass.:
351.374
SMILES:
COC(=O)c1ccc(OC)c(NS(=O)(=O)c2ccc(OC)cc2)c1
: