Target
Beta-2 adrenergic receptor
Ligand
BDBM50419688
Substrate
Meas. Tech.
ChEMBL_800669 (CHEMBL1947791)
IC50
32±n/a nM
Citation
 Alcaraz, LBailey, ACadogan, EConnolly, SJewell, RJordan, SKindon, NLister, ALawson, MMullen, ADainty, INicholls, DPaine, SPairaudeau, GStocks, MJThorne, PYoung, A From libraries to candidate: the discovery of new ultra long-acting dibasicß2-adrenoceptor agonists. Bioorg Med Chem Lett 22:689-95 (2011)  
Target
Name:
Beta-2 adrenergic receptor
Synonyms:
ADRB2 ADRB2_HUMAN Beta-2 adrenoceptor | Beta-2 adrenoreceptor
Type:
Mol. Mass.:
46461.69
Organism:
Homo sapiens (Human)
Description:
P07550
Residue:
413
  
Inhibitor
Name:
BDBM50419688
Synonyms:
CHEMBL1947152
Type:
Small organic molecule
Emp. Form.:
C31H31N3O2S
Mol. Mass.:
509.662
SMILES:
Oc1ccc(CCNCCc2cccc(c2)-c2cccc(CNCc3ccccc3)c2)c2sc(=O)[nH]c12
: