Target
Alpha-1D adrenergic receptor
Ligand
BDBM50419673
Substrate
Meas. Tech.
ChEMBL_800687 (CHEMBL1947809)
IC50
13±n/a nM
Citation
 Alcaraz, LBailey, ACadogan, EConnolly, SJewell, RJordan, SKindon, NLister, ALawson, MMullen, ADainty, INicholls, DPaine, SPairaudeau, GStocks, MJThorne, PYoung, A From libraries to candidate: the discovery of new ultra long-acting dibasicß2-adrenoceptor agonists. Bioorg Med Chem Lett 22:689-95 (2011)  
Target
Name:
Alpha-1D adrenergic receptor
Synonyms:
ADA1D_HUMAN ADRA1D Adrenergic receptor alpha Alpha 1D-adrenoreceptor Alpha-1D adrenoceptor adrenergic Alpha1D
Type:
Enzyme Catalytic Domain
Mol. Mass.:
60485.82
Organism:
Homo sapiens (Human)
Description:
adrenergic Alpha1D ADRA1D HUMAN::P25100
Residue:
572
  
Inhibitor
Name:
BDBM50419673
Synonyms:
CHEMBL1944695
Type:
Small organic molecule
Emp. Form.:
C26H29N3O3S
Mol. Mass.:
463.592
SMILES:
O[C@@H](CNCCc1ccc(CNCCc2ccccc2)cc1)c1ccc(O)c2[nH]c(=O)sc12
: