Target
Solute carrier family 22 member 2
Ligand
BDBM35938
Substrate
Meas. Tech.
ChEMBL_838484 (CHEMBL2076055)
IC50
26000±n/a nM
Citation
 Urakami, YOkuda, MMasuda, SAkazawa, MSaito, HInui, K Distinct characteristics of organic cation transporters, OCT1 and OCT2, in the basolateral membrane of renal tubules. Pharm Res 18:1528-34 (2001)  
Target
Name:
Solute carrier family 22 member 2
Synonyms:
Adrenaline alpha2 Organic cation transporter 2 Slc22a2 rOCT2
Type:
Enzyme Catalytic Domain
Mol. Mass.:
62348.38
Organism:
RAT
Description:
Adrenaline alpha2 0 RAT::Q9R0W2
Residue:
555
  
Inhibitor
Name:
BDBM35938
Synonyms:
1-(p-chlorophenyl)-1-(2-pyridyl)-3-N,N-dimethylpropylamine 3-(p-chlorophenyl)-3-(2-pyridyl)-N,N-dimethylpropylamine CHEMBL505 CHLORPHENIRAMINE MALEATE Polaramine [3H]Chlorphenamine chlorophenylpyridamine clorfeniramina gamma-(4-chlorophenyl)-N,N-dimethyl-2-pyridinepropanamine | gamma-(4-chlorophenyl)-gamma-(2-pyridyl)propyldimethylamine
Type:
radiolabeled ligand
Emp. Form.:
C16H19ClN2
Mol. Mass.:
274.788
SMILES:
CN(C)CCC(c1ccc(Cl)cc1)c1ccccn1
: