Target
Solute carrier family 22 member 2
Ligand
BDBM50028893
Substrate
Meas. Tech.
ChEMBL_838507 (CHEMBL2078135)
Ki
30000±n/a nM
Citation
 Urakami, YOkuda, MMasuda, SAkazawa, MSaito, HInui, K Distinct characteristics of organic cation transporters, OCT1 and OCT2, in the basolateral membrane of renal tubules. Pharm Res 18:1528-34 (2001)  
Target
Name:
Solute carrier family 22 member 2
Synonyms:
Adrenaline alpha2 Organic cation transporter 2 Slc22a2 rOCT2
Type:
Enzyme Catalytic Domain
Mol. Mass.:
62348.38
Organism:
RAT
Description:
Adrenaline alpha2 0 RAT::Q9R0W2
Residue:
555
  
Inhibitor
Name:
BDBM50028893
Synonyms:
4-(diisopropylamino)-2-phenyl-2-pyridin-2-ylbutanamide DISOPYRAMIDE gamma-Diisopropylamino-alpha-phenyl-alpha-(2-pyridyl)butyramide
Type:
Small organic molecule
Emp. Form.:
C21H29N3O
Mol. Mass.:
339.4745
SMILES:
CC(C)N(CCC(C(N)=O)(c1ccccc1)c1ccccn1)C(C)C
: