Target
Bile salt export pump
Ligand
BDBM50420205
Substrate
Meas. Tech.
ChEMBL_836622 (CHEMBL2077363)
IC50
600±n/a nM
Citation
 Funk, CPantze, MJehle, LPonelle, CScheuermann, GLazendic, MGasser, R Troglitazone-induced intrahepatic cholestasis by an interference with the hepatobiliary export of bile acids in male and female rats. Correlation with the gender difference in troglitazone sulfate formation and the inhibition of the canalicular bile salt export pump (Bsep) by troglitazone and trogl Toxicology 167:83-98 (2001)  
Target
Name:
Bile salt export pump
Synonyms:
ABCBB_RAT Abcb11 Bile salt export pump Sister of P-glycoprotein | Spgp
Type:
PROTEIN
Mol. Mass.:
146267.86
Organism:
Rattus norvegicus
Description:
ChEMBL_1481883
Residue:
1321
  
Inhibitor
Name:
BDBM50420205
Synonyms:
CHEMBL2074778
Type:
Small organic molecule
Emp. Form.:
C24H27NO8S2
Mol. Mass.:
521.603
SMILES:
Cc1c(C)c2OC(C)(COc3ccc(Cc4sc(=O)[nH]c4O)cc3)CCc2c(C)c1OS(O)(=O)=O
: