Target
ATP-dependent translocase ABCB1
Ligand
BDBM50420182
Substrate
Meas. Tech.
ChEMBL_837636 (CHEMBL2076589)
Ki
210±n/a nM
Citation
 Marbeuf-Gueye, CSalerno, MQuidu, PGarnier-Suillerot, A Inhibition of the P-glycoprotein- and multidrug resistance protein-mediated efflux of anthracyclines and calceinacetoxymethyl ester by PAK-104P. Eur J Pharmacol 391:207-16 (2000)  
Target
Name:
ATP-dependent translocase ABCB1
Synonyms:
ABCB1 MDR1_HUMAN Multidrug resistance protein 1 P-glycoprotein (P-gp) PGY1
Type:
Protein
Mol. Mass.:
141503.50
Organism:
Homo sapiens (Human)
Description:
P08183
Residue:
1280
  
Inhibitor
Name:
BDBM50420182
Synonyms:
CHEMBL2074650
Type:
Small organic molecule
Emp. Form.:
C38H43N4O7P
Mol. Mass.:
698.7444
SMILES:
C[C@@H]1C[C@@H](C)OP(=O)(O1)c1c(C)nc(C)c(C(=O)OCCN2CCN(CC2)C(c2ccccc2)c2ccccc2)c1-c1cccc(c1)[N+]([O-])=O
: