Target
ATP-dependent translocase ABCB1
Ligand
BDBM82507
Substrate
Meas. Tech.
ChEMBL_837066 (CHEMBL2076318)
IC50
7500±n/a nM
Citation
 Störmer, EPerloff, MDvon Moltke, LLGreenblatt, DJ Methadone inhibits rhodamine123 transport in Caco-2 cells. Drug Metab Dispos 29:954-6 (2001) Target
Name:
ATP-dependent translocase ABCB1
Synonyms:
ABCB1 MDR1_HUMAN Multidrug resistance protein 1 P-glycoprotein (P-gp) PGY1
Type:
Protein
Mol. Mass.:
141503.50
Organism:
Homo sapiens (Human)
Description:
P08183
Residue:
1280
  
Inhibitor
Name:
BDBM82507
Synonyms:
(+/-)-Methadone METHADONE NSC_22266
Type:
Small organic molecule
Emp. Form.:
C21H27NO
Mol. Mass.:
309.4452
SMILES:
CCC(=O)C(CC(C)N(C)C)(c1ccccc1)c1ccccc1
: