Target
ATP-binding cassette sub-family C member 4
Ligand
BDBM23617
Substrate
Meas. Tech.
ChEMBL_835930 (CHEMBL2077068)
IC50
75000±n/a nM
Citation
 Reid, GWielinga, PZelcer, NDe Haas, MVan Deemter, LWijnholds, JBalzarini, JBorst, P Characterization of the transport of nucleoside analog drugs by the human multidrug resistance proteins MRP4 and MRP5. Mol Pharmacol 63:1094-103 (2003)  
Target
Name:
ATP-binding cassette sub-family C member 4
Synonyms:
ABCC4 MOAT-B MRP/cMOAT-related ABC transporter MRP4_HUMAN Multidrug resistance-associated protein 4
Type:
PROTEIN
Mol. Mass.:
149546.12
Organism:
Homo sapiens (Human)
Description:
ChEMBL_1486828
Residue:
1325
  
Inhibitor
Name:
BDBM23617
Synonyms:
(2R,3S,4R,5R)-2-(hydroxymethyl)-5-(6-{[(4-nitrophenyl)methyl]sulfanyl}-9H-purin-9-yl)oxolane-3,4-diol CHEMBL418509 NBTI | Nitrobenzylthioinosine
Type:
Small organic molecule
Emp. Form.:
C17H17N5O6S
Mol. Mass.:
419.412
SMILES:
OC[C@H]1O[C@H]([C@H](O)[C@@H]1O)n1cnc2c(SCc3ccc(cc3)[N+]([O-])=O)ncnc12
: