Target
Solute carrier family 22 member 6
Ligand
BDBM20688
Substrate
Meas. Tech.
ChEMBL_836628 (CHEMBL2077470)
Ki
1150000±n/a nM
Citation
 Hasegawa, MKusuhara, HSugiyama, DIto, KUeda, SEndou, HSugiyama, Y Functional involvement of rat organic anion transporter 3 (rOat3; Slc22a8) in the renal uptake of organic anions. J Pharmacol Exp Ther 300:746-53 (2002)  
Target
Name:
Solute carrier family 22 member 6
Synonyms:
Oat1 S22A6_RAT rOAT1 renal organic anion transporter 1
Type:
PROTEIN
Mol. Mass.:
60784.17
Organism:
Rattus norvegicus
Description:
ChEMBL_838479
Residue:
551
  
Inhibitor
Name:
BDBM20688
Synonyms:
(3R,5R)-7-[(1S,2S,6S,8S,8aR)-6-hydroxy-2-methyl-8-{[(2S)-2-methylbutanoyl]oxy}-1,2,6,7,8,8a-hexahydronaphthalen-1-yl]-3,5-dihydroxyheptanoic acid Pravastatin
Type:
Small organic molecule
Emp. Form.:
C23H36O7
Mol. Mass.:
424.5277
SMILES:
[H][C@]12[C@H](C[C@H](O)C=C1C=C[C@H](C)[C@@H]2CC[C@@H](O)C[C@@H](O)CC(O)=O)OC(=O)[C@@H](C)CC
: