Target
Solute carrier organic anion transporter family member 1A1
Ligand
BDBM8885
Substrate
Meas. Tech.
ChEMBL_838286 (CHEMBL2076234)
Ki
5400±n/a nM
Citation
 Kanai, NLu, RBao, YWolkoff, AWVore, MSchuster, VL Estradiol 17 beta-D-glucuronide is a high-affinity substrate for oatp organic anion transporter. Am J Physiol 270:326-31 (1996)  
Target
Name:
Solute carrier organic anion transporter family member 1A1
Synonyms:
OATP-1 Oatp1a1 SO1A1_RAT Slco1a1 Solute carrier family 21 member 1
Type:
PROTEIN
Mol. Mass.:
74188.94
Organism:
Rattus norvegicus
Description:
ChEMBL_838286
Residue:
670
  
Inhibitor
Name:
BDBM8885
Synonyms:
(1S,2R,10R,11S,14S,15S)-14-hydroxy-2,15-dimethyltetracyclo[8.7.0.0^{2,7}.0^{11,15}]heptadec-6-en-5-one Testosterone US9682960, Testosterone
Type:
Steroid
Emp. Form.:
C19H28O2
Mol. Mass.:
288.4244
SMILES:
[H][C@@]12CC[C@H](O)[C@@]1(C)CC[C@@]1([H])[C@@]2([H])CCC2=CC(=O)CC[C@]12C
: