Target
Adenosine receptor A3
Ligand
BDBM50420423
Substrate
Meas. Tech.
ChEMBL_840841 (CHEMBL2090624)
Ki
39±n/a nM
Citation
 Tosh, DKPaoletta, SPhan, KGao, ZGJacobson, KA Truncated Nucleosides as A(3) Adenosine Receptor Ligands: Combined 2-Arylethynyl and Bicyclohexane Substitutions. ACS Med Chem Lett 3:596-601 (2012)  
Target
Name:
Adenosine receptor A3
Synonyms:
A3 adenosine receptor (hA3) ADORA3 | Adenosine A3 receptor (A3AR)
Type:
G Protein-Coupled Receptor (GPCR)
Mol. Mass.:
36197.32
Organism:
Homo sapiens (Human)
Description:
P0DMS8
Residue:
318
  
Inhibitor
Name:
BDBM50420423
Synonyms:
CHEMBL2089341
Type:
Small organic molecule
Emp. Form.:
C26H22ClN5O2
Mol. Mass.:
471.938
SMILES:
O[C@@H]1[C@@H]2C[C@@H]2[C@H]([C@@H]1O)n1cnc2c(NCc3cccc(Cl)c3)nc(nc12)C#Cc1ccccc1
: