Target
Mitogen-activated protein kinase 13
Ligand
BDBM50420754
Substrate
Meas. Tech.
ChEMBL_842608 (CHEMBL2092446)
IC50
14±n/a nM
Citation
 Aiguadé, JBalagué, CCarranco, ICaturla, FDomínguez, MEastwood, PEsteve, CGonzález, JLumeras, WOrellana, APreciado, SRoca, RVidal, LVidal, B Novel triazolopyridylbenzamides as potent and selective p38a inhibitors. Bioorg Med Chem Lett 22:3431-6 (2012)  
Target
Name:
Mitogen-activated protein kinase 13
Synonyms:
MAP kinase p38 delta MK13_HUMAN Mitogen-activated protein kinase 13 (MAPK13) Mitogen-activated protein kinase p38 delta SAPK4 p38 delta/gamma
Type:
Enzyme
Mol. Mass.:
42097.16
Organism:
Homo sapiens (Human)
Description:
O15264
Residue:
365
  
Inhibitor
Name:
BDBM50420754
Synonyms:
CHEMBL2087499
Type:
Small organic molecule
Emp. Form.:
C23H25N3O2
Mol. Mass.:
375.4635
SMILES:
Cc1ccc(cc1-c1ccc2c(noc2c1)N1CCCCC1)C(=O)NC1CC1
: