Target
Nociceptin receptor
Ligand
BDBM50420810
Substrate
Meas. Tech.
ChEMBL_839690 (CHEMBL2090804)
Ki
0.114000±n/a nM
Citation
 Pedregal, CJoshi, EMToledo, MALafuente, CDiaz, NMartinez-Grau, MAJiménez, ABenito, ANavarro, AChen, ZMudra, DRKahl, SDRash, KSStatnick, MABarth, VN Development of LC-MS/MS-based receptor occupancy tracers and positron emission tomography radioligands for the nociceptin/orphanin FQ (NOP) receptor. J Med Chem 55:4955-67 (2012)  
Target
Name:
Nociceptin receptor
Synonyms:
KOR-3 Mu-type opioid receptor (Mu) Nociceptin Receptor (ORL1 Receptor) Nociceptin receptor (ORL-1) Nociceptin/Orphanin FQ, NOP receptor OPIATE ORL-1 OPRL1 protein ORL1 Opioid receptor like-1 Orphanin FQ receptor (ORL1) | P41146
Type:
G Protein-Coupled Receptor (GPCR)
Mol. Mass.:
40702.87
Organism:
Homo sapiens (Human)
Description:
P41146
Residue:
370
  
Inhibitor
Name:
BDBM50420810
Synonyms:
CHEMBL2088060
Type:
Small organic molecule
Emp. Form.:
C23H28F2N2O2S
Mol. Mass.:
434.542
SMILES:
CN(C)C(=O)[C@H](CN1CCC2(CC1)OCCc1cc(F)sc21)Cc1ccccc1F
: