Target
Cannabinoid receptor 2
Ligand
BDBM50420890
Substrate
Meas. Tech.
ChEMBL_840019 (CHEMBL2090509)
Ki
0.37±n/a nM
Citation
 Pasquini, SMugnaini, CLigresti, ATafi, ABrogi, SFalciani, CPedani, VPesco, NGuida, FLuongo, LVarani, KBorea, PAMaione, SDi Marzo, VCorelli, F Design, synthesis, and pharmacological characterization of indol-3-ylacetamides, indol-3-yloxoacetamides, and indol-3-ylcarboxamides: potent and selective CB2 cannabinoid receptor inverse agonists. J Med Chem 55:5391-402 (2012)  
Target
Name:
Cannabinoid receptor 2
Synonyms:
CANNABINOID CB2 CB2 CB2B CNR2_HUMAN Cannabinoid CB2 receptor Cannabinoid receptor 2 (CB2R) | hCB2
Type:
G Protein-Coupled Receptor (GPCR)
Mol. Mass.:
39690.94
Organism:
Homo sapiens (Human)
Description:
P34972
Residue:
360
  
Inhibitor
Name:
BDBM50420890
Synonyms:
CHEMBL2087099
Type:
Small organic molecule
Emp. Form.:
C29H34N2O3
Mol. Mass.:
458.5919
SMILES:
CCCCCn1cc(C(=O)C(=O)NC23CC4CC(CC(C4)C2)C3)c2cc(ccc12)-c1ccco1
: