Target
Glutamate racemase
Ligand
BDBM50421042
Substrate
Meas. Tech.
ChEMBL_842443 (CHEMBL2092116)
IC50
39±n/a nM
Citation
 Basarab, GSHill, PEyermann, CJGowravaram, MKäck, HOsimoni, E Design of inhibitors of Helicobacter pylori glutamate racemase as selective antibacterial agents: incorporation of imidazoles onto a core pyrazolopyrimidinedione scaffold to improve bioavailabilty. Bioorg Med Chem Lett 22:5600-7 (2012)  
Target
Name:
Glutamate racemase
Synonyms:
MURI_HELPJ murI
Type:
PROTEIN
Mol. Mass.:
28499.39
Organism:
Helicobacter pylori J99
Description:
ChEMBL_842443
Residue:
255
  
Inhibitor
Name:
BDBM50421042
Synonyms:
CHEMBL2087619
Type:
Small organic molecule
Emp. Form.:
C27H25ClN6O3
Mol. Mass.:
516.979
SMILES:
CC(=O)c1cc(-c2n(Cc3ccnc4ccc(Cl)cc34)nc3n(CC4CC4)c(=O)n(C)c(=O)c23)n(C)c1
: