Target
Glutamate racemase
Ligand
BDBM50421066
Substrate
Meas. Tech.
ChEMBL_842443 (CHEMBL2092116)
IC50
51±n/a nM
Citation
 Basarab, GSHill, PEyermann, CJGowravaram, MKäck, HOsimoni, E Design of inhibitors of Helicobacter pylori glutamate racemase as selective antibacterial agents: incorporation of imidazoles onto a core pyrazolopyrimidinedione scaffold to improve bioavailabilty. Bioorg Med Chem Lett 22:5600-7 (2012)  
Target
Name:
Glutamate racemase
Synonyms:
MURI_HELPJ murI
Type:
PROTEIN
Mol. Mass.:
28499.39
Organism:
Helicobacter pylori J99
Description:
ChEMBL_842443
Residue:
255
  
Inhibitor
Name:
BDBM50421066
Synonyms:
CHEMBL2087857
Type:
Small organic molecule
Emp. Form.:
C33H31ClN8O3
Mol. Mass.:
623.104
SMILES:
Cn1cc(cc1-c1n(Cc2ccnc3ccc(Cl)cc23)nc2n(CC3CC3)c(=O)n(CC#CCN3CCOCC3)c(=O)c12)C#N
: