Target
5-hydroxytryptamine receptor 1A
Ligand
BDBM50421373
Substrate
Meas. Tech.
ChEBML_1555
IC50
0.128825±n/a nM
Citation
  TBA Bioorg Med Chem Lett 6:1077-1082 (1996)    Article 
Target
Name:
5-hydroxytryptamine receptor 1A
Synonyms:
5-HT-1A 5-hydroxytryptamine receptor 1A (5-HT-1A) ADRB2RL1 Dopamine D2 receptor and serotonin 1a receptor HTR1A | Serotonin receptor 1A
Type:
Mol. Mass.:
46122.49
Organism:
Homo sapiens (Human)
Description:
Residue:
422
  
Inhibitor
Name:
BDBM50421373
Synonyms:
CHEMBL416523
Type:
Small organic molecule
Emp. Form.:
C24H34N2O4
Mol. Mass.:
414.5378
SMILES:
COc1cccc2OCC(CNCCCCN3C(=O)CC4(CCCC4)CC3=O)Cc12
: