Target
Alpha-1A adrenergic receptor
Ligand
BDBM50219162
Substrate
Meas. Tech.
ChEMBL_30096 (CHEMBL640032)
EC50
<5012±n/a nM
Citation
 Bishop, MJBerman, JBigham, ECGarrison, DTGobel, MJHodson, SJIrving, PELiacos, JAMinick, DJNavas, FSaussy, DLSpeake, JD 2-(Anilinomethyl)imidazolines as alpha(1)-adrenoceptor agonists: the identification of alpha(1A) subtype selective 2'-carboxylic acid esters and amides. Bioorg Med Chem Lett 11:2871-4 (2001)  
Target
Name:
Alpha-1A adrenergic receptor
Synonyms:
ADA1A_HUMAN ADRA1C Alpha 1A-adrenoceptor Alpha adrenergic receptor 1a Alpha-adrenergic receptor 1c adrenergic Alpha1 | adrenergic Alpha1C
Type:
Cell-surface receptors
Mol. Mass.:
51511.67
Organism:
Homo sapiens (Human)
Description:
P35348
Residue:
466
  
Inhibitor
Name:
BDBM50219162
Synonyms:
CHEMBL98921
Type:
Small organic molecule
Emp. Form.:
C17H23N3O2
Mol. Mass.:
301.3834
SMILES:
O=C(OC1CCCCC1)c1ccccc1NCC1=NCCN1
: