Target
Alpha-1D adrenergic receptor
Ligand
BDBM50219152
Substrate
Meas. Tech.
ChEMBL_30101 (CHEMBL642028)
EC50
<5012±n/a nM
Citation
 Bishop, MJBerman, JBigham, ECGarrison, DTGobel, MJHodson, SJIrving, PELiacos, JAMinick, DJNavas, FSaussy, DLSpeake, JD 2-(Anilinomethyl)imidazolines as alpha(1)-adrenoceptor agonists: the identification of alpha(1A) subtype selective 2'-carboxylic acid esters and amides. Bioorg Med Chem Lett 11:2871-4 (2001)  
Target
Name:
Alpha-1D adrenergic receptor
Synonyms:
ADA1D_HUMAN ADRA1D Adrenergic receptor alpha Alpha 1D-adrenoreceptor Alpha-1D adrenoceptor adrenergic Alpha1D
Type:
Enzyme Catalytic Domain
Mol. Mass.:
60485.82
Organism:
Homo sapiens (Human)
Description:
adrenergic Alpha1D ADRA1D HUMAN::P25100
Residue:
572
  
Inhibitor
Name:
BDBM50219152
Synonyms:
CHEMBL100383
Type:
Small organic molecule
Emp. Form.:
C16H23N3O2
Mol. Mass.:
289.3727
SMILES:
CCC(CC)OC(=O)c1ccccc1NCC1=NCCN1
: