Target
Alpha-1D adrenergic receptor
Ligand
BDBM50027060
Substrate
Meas. Tech.
ChEMBL_30101 (CHEMBL642028)
EC50
126±n/a nM
Citation
 Bishop, MJBerman, JBigham, ECGarrison, DTGobel, MJHodson, SJIrving, PELiacos, JAMinick, DJNavas, FSaussy, DLSpeake, JD 2-(Anilinomethyl)imidazolines as alpha(1)-adrenoceptor agonists: the identification of alpha(1A) subtype selective 2'-carboxylic acid esters and amides. Bioorg Med Chem Lett 11:2871-4 (2001)  
Target
Name:
Alpha-1D adrenergic receptor
Synonyms:
ADA1D_HUMAN ADRA1D Adrenergic receptor alpha Alpha 1D-adrenoreceptor Alpha-1D adrenoceptor adrenergic Alpha1D
Type:
Enzyme Catalytic Domain
Mol. Mass.:
60485.82
Organism:
Homo sapiens (Human)
Description:
adrenergic Alpha1D ADRA1D HUMAN::P25100
Residue:
572
  
Inhibitor
Name:
BDBM50027060
Synonyms:
2-(2-Cyclopropyl-phenoxymethyl)-4,5-dihydro-1H-imidazole CHEMBL13852 | CIRAZOLINE
Type:
Small organic molecule
Emp. Form.:
C13H16N2O
Mol. Mass.:
216.2789
SMILES:
C(Oc1ccccc1C1CC1)C1=NCCN1
: