Target
Alpha-1B adrenergic receptor
Ligand
BDBM50218569
Substrate
Meas. Tech.
ChEMBL_32514 (CHEMBL641229)
IC50
<30200±n/a nM
Citation
 Hodson, SJBigham, ECGarrison, DTGobel, MJIrving, PELiacos, JANavas, FSaussy, DLSherman, BWSpeake, JDBishop, MJ Alpha(1)-adrenoceptor activation: a comparison of 4-(anilinomethyl)imidazoles and 4-(phenoxymethyl)imidazoles to related 2-imidazolines. Bioorg Med Chem Lett 12:3449-52 (2002)  
Target
Name:
Alpha-1B adrenergic receptor
Synonyms:
ADA1B_HUMAN Adrenergic alpha1B Adrenergic receptor alpha Alpha 1B-adrenoreceptor | Alpha-1B adrenergic receptor
Type:
Enzyme
Mol. Mass.:
56862.13
Organism:
Homo sapiens (Human)
Description:
P35368
Residue:
520
  
Inhibitor
Name:
BDBM50218569
Synonyms:
CHEMBL326837
Type:
Small organic molecule
Emp. Form.:
C15H19N3O2
Mol. Mass.:
273.3303
SMILES:
CCN(CC)C(=O)c1ccccc1OCc1c[nH]cn1
: