Target
Alpha-1B adrenergic receptor
Ligand
BDBM50421592
Substrate
Meas. Tech.
ChEMBL_34481 (CHEMBL651235)
IC50
2042±n/a nM
Citation
 Bishop, MJBarvian, KABerman, JBigham, ECGarrison, DTGobel, MJHodson, SJIrving, PELiacos, JANavas, FSaussy, DLSpeake, JD alpha(1)-Adrenoceptor agonists: the identification of novel alpha(1A )subtype selective 2'-heteroaryl-2-(phenoxymethyl)imidazolines. Bioorg Med Chem Lett 12:471-5 (2002)  
Target
Name:
Alpha-1B adrenergic receptor
Synonyms:
ADA1B_HUMAN Adrenergic alpha1B Adrenergic receptor alpha Alpha 1B-adrenoreceptor | Alpha-1B adrenergic receptor
Type:
Enzyme
Mol. Mass.:
56862.13
Organism:
Homo sapiens (Human)
Description:
P35368
Residue:
520
  
Inhibitor
Name:
BDBM50421592
Synonyms:
CHEMBL420683
Type:
Small organic molecule
Emp. Form.:
C15H15N3O
Mol. Mass.:
253.2991
SMILES:
C(Oc1ccccc1-c1ccccn1)C1=NCCN1
: