Target
Alpha-1A adrenergic receptor
Ligand
BDBM50001922
Substrate
Meas. Tech.
ChEMBL_33758 (CHEMBL650231)
EC50
63±n/a nM
Citation
 Navas, FBishop, MJGarrison, DTHodson, SJSpeake, JDBigham, ECDrewry, DHSaussy, DLLiacos, JHIrving, PEGobel, MJ 2-(anilinomethyl)imidazolines as alpha1A adrenergic receptor agonists: 2'-heteroaryl and 2'-oxime ether series. Bioorg Med Chem Lett 12:575-9 (2002)  
Target
Name:
Alpha-1A adrenergic receptor
Synonyms:
ADA1A_HUMAN ADRA1C Alpha 1A-adrenoceptor Alpha adrenergic receptor 1a Alpha-adrenergic receptor 1c adrenergic Alpha1 | adrenergic Alpha1C
Type:
Cell-surface receptors
Mol. Mass.:
51511.67
Organism:
Homo sapiens (Human)
Description:
P35348
Residue:
466
  
Inhibitor
Name:
BDBM50001922
Synonyms:
2-Naphthalen-1-ylmethyl-4,5-dihydro-1H-imidazole; hydrochloride CHEMBL1706 Nafazair Naphazoline Nitrate Opcon cid_11079
Type:
Small organic molecule
Emp. Form.:
C14H14N2
Mol. Mass.:
210.2744
SMILES:
C(C1=NCCN1)c1cccc2ccccc12
: