Target
Integrin alpha-4/beta-1
Ligand
BDBM50128325
Substrate
Meas. Tech.
ChEMBL_213391 (CHEMBL818049)
IC50
0.100000±n/a nM
Citation
 Doherty, GAYang, GXBorges, ETong, SMcCauley, EDTreonz, KMVan Riper, GPacholok, SSi, QKoo, GCShah, KMumford, RAHagmann, WK N-isonicotinoyl-(L)-4-aminophenylalanine derivatives as tight binding VLA-4 antagonists. Bioorg Med Chem Lett 13:1891-5 (2003)  
Target
Name:
Integrin alpha-4/beta-1
Synonyms:
Fibronectin receptor beta/Integrin alpha-4 | Integrin alpha-4/beta-1
Type:
Mol. Mass.:
Description:
ASSAY_ID of EBI is 88912
Components:
This complex has 2 components.
Component 1
Name:
Integrin beta-1
Synonyms:
CD_antigen=CD29 Fibronectin receptor beta GPIIA ITGB1 MDF2 | MSK12
Type:
Enzyme
Mol. Mass.:
88400.38
Organism:
Homo sapiens (Human)
Description:
P05556
Residue:
798
  
Component 2
Name:
Integrin alpha-4
Synonyms:
CD49 antigen-like family member D CD49d antigen ITA4_HUMAN Integrin alpha-4 Integrin alpha-IV VLA-4 integrin alpha 4 precursor | integrin alpha-4 precursor
Type:
Membrane Protein
Mol. Mass.:
114897.35
Organism:
Homo sapiens (Human)
Description:
P13612
Residue:
1032
  
Inhibitor
Name:
BDBM50128325
Synonyms:
4-[4-((S)-2-Carboxy-2-{[(S)-1-(3,5-dichloro-benzenesulfonyl)-2-methyl-pyrrolidine-2-carbonyl]-amino}-ethyl)-phenylcarbamoyl]-3,5-dichloro-1-methyl-pyridinium | CHEMBL56520
Type:
Small organic molecule
Emp. Form.:
C28H27Cl4N4O6S
Mol. Mass.:
689.414
SMILES:
C[n+]1cc(Cl)c(C(=O)Nc2ccc(C[C@H](NC(=O)[C@]3(C)CCCN3S(=O)(=O)c3cc(Cl)cc(Cl)c3)C(O)=O)cc2)c(Cl)c1
: