Target
Alpha-1A adrenergic receptor
Ligand
BDBM50222924
Substrate
Meas. Tech.
ChEMBL_33756 (CHEMBL858097)
EC50
1000±n/a nM
Citation
 Speake, JDNavas, FBishop, MJGarrison, DTBigham, ECHodson, SJSaussy, DLLiacos, JAIrving, PESherman, BW 2-(Anilinomethyl)imidazolines as alpha1 adrenergic receptor agonists: alpha1a subtype selective 2'-heteroaryl compounds. Bioorg Med Chem Lett 13:1183-6 (2003)  
Target
Name:
Alpha-1A adrenergic receptor
Synonyms:
ADA1A_HUMAN ADRA1C Alpha 1A-adrenoceptor Alpha adrenergic receptor 1a Alpha-adrenergic receptor 1c adrenergic Alpha1 | adrenergic Alpha1C
Type:
Cell-surface receptors
Mol. Mass.:
51511.67
Organism:
Homo sapiens (Human)
Description:
P35348
Residue:
466
  
Inhibitor
Name:
BDBM50222924
Synonyms:
CHEMBL17819
Type:
Small organic molecule
Emp. Form.:
C14H18N6
Mol. Mass.:
270.3329
SMILES:
Cc1nc(-c2ccccc2NCC2=NCCN2)n(C)n1
: