Target
5-hydroxytryptamine receptor 1B
Ligand
BDBM50421837
Substrate
Meas. Tech.
ChEBML_1813
IC50
3236±n/a nM
Citation
 Hibert, MFGittos, MWMiddlemiss, DNMir, AKFozard, JR Graphics computer-aided receptor mapping as a predictive tool for drug design: development of potent, selective, and stereospecific ligands for the 5-HT1A receptor. J Med Chem 31:1087-93 (1988)  
Target
Name:
5-hydroxytryptamine receptor 1B
Synonyms:
5-HT-1B 5-hydroxytryptamine receptor 1B (5HT1B) 5ht1b Serotonin 1 (5-HT1) receptor Serotonin receptor 1B
Type:
Protein
Mol. Mass.:
43173.33
Organism:
Rattus norvegicus (Rat)
Description:
P28564
Residue:
386
  
Inhibitor
Name:
BDBM50421837
Synonyms:
CHEMBL273490
Type:
Small organic molecule
Emp. Form.:
C20H24N2S2
Mol. Mass.:
356.548
SMILES:
CSc1ccc2Sc3ccccc3C[C@@H](N3CCN(C)CC3)c2c1
: