Target
Sigma non-opioid intracellular receptor 1
Ligand
BDBM50421912
Substrate
Meas. Tech.
ChEBML_201733
IC50
3.5±n/a nM
Citation
 Russell, MGBaker, RBillington, DCKnight, AKMiddlemiss, DNNoble, AJ Benz[f]isoquinoline analogues as high-affinity sigma ligands. J Med Chem 35:2025-33 (1992)  
Target
Name:
Sigma non-opioid intracellular receptor 1
Synonyms:
Aging-associated gene 8 protein SGMR1_HUMAN SIGMAR1 SR31747-binding protein Sigma 1-type opioid receptor Sigma1R | hSigmaR1
Type:
Enzyme Catalytic Domain
Mol. Mass.:
25124.85
Organism:
Homo sapiens (Human)
Description:
Q99720
Residue:
223
  
Inhibitor
Name:
BDBM50421912
Synonyms:
CHEMBL545447
Type:
Small organic molecule
Emp. Form.:
C21H24N2O2
Mol. Mass.:
336.4275
SMILES:
[O-][N+](=O)c1ccc(CCN2CC[C@@H]3[C@@H](CCc4ccccc34)C2)cc1
: