Target
Thromboxane A2 receptor
Ligand
BDBM82497
Substrate
Meas. Tech.
ChEMBL_209428 (CHEMBL814285)
IC50
2455±n/a nM
Citation
 Markovich, KMTantishaiyakul, VHamada, AMiller, DDRomstedt, KJShams, GShin, YFraundorfer, PFDoyle, KFeller, DR Synthesis of halogenated trimetoquinol derivatives and evaluation of their beta-agonist and thromboxane A2 (TXA2) antagonist activities. J Med Chem 35:466-79 (1992)  
Target
Name:
Thromboxane A2 receptor
Synonyms:
Prostanoid TP receptor TBXA2R Thromboxane Thromboxane Beta
Type:
Enyzme
Mol. Mass.:
37445.28
Organism:
Homo sapiens (Human)
Description:
P21731
Residue:
343
  
Inhibitor
Name:
BDBM82497
Synonyms:
TMQ, R-(-)-8-Fluoro
Type:
Small organic molecule
Emp. Form.:
C19H22FNO5
Mol. Mass.:
363.3801
SMILES:
COc1cc(C[C@H]2NCCc3cc(O)c(O)c(F)c23)cc(OC)c1OC
: