Target
Adenosine receptor A1
Ligand
BDBM50020970
Substrate
Meas. Tech.
ChEMBL_27470 (CHEMBL642479)
Ki
8.7±n/a nM
Citation
 van der Wenden, EMIjzerman, APSoudijn, W A steric and electrostatic comparison of three models for the agonist/antagonist binding site on the adenosine A1 receptor. J Med Chem 35:629-35 (1992)  
Target
Name:
Adenosine receptor A1
Synonyms:
AA1R_RAT ADENOSINE A1 high Adenosine A1 receptor (A1) Adenosine receptors A1 | Adora1
Type:
Protein
Mol. Mass.:
36704.13
Organism:
Rattus norvegicus (rat)
Description:
Residue:
326
  
Inhibitor
Name:
BDBM50020970
Synonyms:
8-(3-Methoxy-phenyl)-1,3-dimethyl-3,7-dihydro-purine-2,6-dione | CHEMBL11439
Type:
Small organic molecule
Emp. Form.:
C14H14N4O3
Mol. Mass.:
286.286
SMILES:
COc1cccc(c1)-c1nc2n(C)c(=O)n(C)c(=O)c2[nH]1
: