Target
Adenosine receptor A1
Ligand
BDBM50021011
Substrate
Meas. Tech.
ChEMBL_27470 (CHEMBL642479)
Ki
1.8±n/a nM
Citation
 van der Wenden, EMIjzerman, APSoudijn, W A steric and electrostatic comparison of three models for the agonist/antagonist binding site on the adenosine A1 receptor. J Med Chem 35:629-35 (1992)  
Target
Name:
Adenosine receptor A1
Synonyms:
AA1R_RAT ADENOSINE A1 high Adenosine A1 receptor (A1) Adenosine receptors A1 | Adora1
Type:
Protein
Mol. Mass.:
36704.13
Organism:
Rattus norvegicus (rat)
Description:
Residue:
326
  
Inhibitor
Name:
BDBM50021011
Synonyms:
8-(4-Fluoro-phenyl)-1,3-dimethyl-3,7-dihydro-purine-2,6-dione | CHEMBL273267
Type:
Small organic molecule
Emp. Form.:
C13H11FN4O2
Mol. Mass.:
274.2504
SMILES:
Cn1c2nc([nH]c2c(=O)n(C)c1=O)-c1ccc(F)cc1
: