Target
5-hydroxytryptamine receptor 5A
Ligand
BDBM50422029
Substrate
Meas. Tech.
ChEMBL_1079 (CHEMBL616402)
IC50
200±n/a nM
Citation
 Castro, JLBaker, RGuiblin, ARHobbs, SCJenkins, MRRussell, MGBeer, MSStanton, JAScholey, KHargreaves, RJ Synthesis and biological activity of 3-[2-(dimethylamino)ethyl]-5-[(1,1-dioxo-5-methyl-1,2,5-thiadiazolidin- 2-yl)-methyl]-1H-indole and analogues: agonists for the 5-HT1D receptor. J Med Chem 37:3023-32 (1994)  
Target
Name:
5-hydroxytryptamine receptor 5A
Synonyms:
5-HT-5 5-hydroxytryptamine receptor 5 (5-HT5) 5HT5A_HUMAN Serotonin (5-HT) receptor | Serotonin receptor 5A
Type:
Enzyme
Mol. Mass.:
40266.25
Organism:
Homo sapiens (Human)
Description:
P47898
Residue:
357
  
Inhibitor
Name:
BDBM50422029
Synonyms:
CHEMBL103388
Type:
Small organic molecule
Emp. Form.:
C24H31N5O3S
Mol. Mass.:
469.6
SMILES:
CN(C)CCc1c[nH]c2ccc(CN3CCN(Cc4ccc(NC(C)=O)cc4)S3(=O)=O)cc12
: