Target
Gag-Pol polyprotein [489-587]
Ligand
BDBM1046
Substrate
Meas. Tech.
ChEMBL_158029 (CHEMBL877854)
IC50
0.16±n/a nM
Citation
 Pérez, CPastor, MOrtiz, ARGago, F Comparative binding energy analysis of HIV-1 protease inhibitors: incorporation of solvent effects and validation as a powerful tool in receptor-based drug design. J Med Chem 41:836-52 (1998)  
Target
Name:
Gag-Pol polyprotein [489-587]
Synonyms:
Human immunodeficiency virus type 1 protease Pol polyprotein | gag-pol
Type:
Enzyme Subunit
Mol. Mass.:
10781.16
Organism:
Human immunodeficiency virus type 1
Description:
P04585[489-587]
Residue:
99
  
Inhibitor
Name:
BDBM1046
Synonyms:
CHEMBL298316 tert-butyl N-[(2S,3S,5R)-3-hydroxy-5-{[(1S,2R)-2-hydroxy-2,3-dihydro-1H-inden-1-yl]carbamoyl}-5-[(4-hydroxyphenyl)methyl]-1-phenylpentan-2-yl]carbamate
Type:
Small organic molecule
Emp. Form.:
C33H40N2O6
Mol. Mass.:
560.6805
SMILES:
[H][C@@]1(NC(=O)[C@@H](C[C@H](O)[C@H](Cc2ccccc2)NC(=O)OC(C)(C)C)Cc2ccc(O)cc2)[C@H](O)Cc2ccccc12
: