Target
Progesterone receptor
Ligand
BDBM50422868
Substrate
Meas. Tech.
ChEMBL_366014 (CHEMBL853401)
IC50
251±n/a nM
Citation
 Wiethe, RWStewart, ELDrewry, DHGray, DWMehbob, AHoekstra, WJ Array synthesis of progesterone receptor antagonists: 3-aryl-1,2-diazepines. Bioorg Med Chem Lett 16:3777-9 (2006)  
Target
Name:
Progesterone receptor
Synonyms:
NR3C3 PGR PRGR_HUMAN | progesterone
Type:
Protein
Mol. Mass.:
98979.52
Organism:
Homo sapiens (Human)
Description:
P06401
Residue:
933
  
Inhibitor
Name:
BDBM50422868
Synonyms:
CHEMBL379276
Type:
Small organic molecule
Emp. Form.:
C15H14Br2N2O2S2
Mol. Mass.:
478.222
SMILES:
Brc1ccc(s1)S(=O)(=O)N1CCCCC(=N1)c1cccc(Br)c1
: